{"text_format":"1","workbook":"xlsx","n_sheets":2,"sheets":["Anexo Cuantitativo","Pbr's"],"not_rendered":{"charts":0,"images":0,"macros":1,"external_links":0,"defined_names":8,"comments":0,"pivot_tables":0},"unopened":[],"bounds":{"document_bytes":16777216,"sheet_cells":100000,"rows_first":2000,"rows_last":500,"rows_between":2000,"halvings":0,"cell_chars":16384,"cell_head_chars":4096},"cells_cut":0,"cells_raw":0,"read":"whole","date_system":"1900"}

{"sheet":"Anexo Cuantitativo","index":0,"n_rows":181,"n_cols":16,"rows_kept":181,"cut":false,"hidden":false,"merged":[[9,1,10,1],[9,2,10,2],[9,3,10,3],[9,4,10,4],[9,5,10,5],[9,6,10,6],[9,7,10,7],[9,12,10,12],[9,13,10,13],[0,3,0,7],[3,1,3,13],[4,1,4,2],[4,3,4,13],[5,1,5,2],[5,3,5,13],[6,1,6,2],[6,3,6,13],[7,1,8,13],[17,1,20,1],[17,3,17,13],[18,3,18,13],[19,3,19,13],[20,3,20,13],[12,3,12,13],[13,3,13,13],[14,3,14,13],[15,3,15,13],[12,1,15,1],[27,1,30,1],[27,3,27,13],[28,3,28,13],[29,3,29,13],[30,3,30,13],[22,1,25,1],[22,3,22,13],[23,3,23,13],[24,3,24,13],[25,3,25,13],[37,1,40,1],[37,3,37,13],[38,3,38,13],[39,3,39,13],[40,3,40,13],[32,1,35,1],[32,3,32,13],[33,3,33,13],[34,3,34,13],[35,3,35,13],[47,1,50,1],[47,3,47,13],[48,3,48,13],[50,3,50,13],[42,1,45,1],[42,3,42,13],[43,3,43,13],[44,3,44,13],[45,3,45,13],[49,3,49,13],[57,1,60,1],[57,3,57,13],[58,3,58,13],[59,3,59,13],[60,3,60,13],[52,1,55,1],[52,3,52,13],[53,3,53,13],[54,3,54,13],[55,3,55,13],[67,1,70,1],[67,3,67,13],[68,3,68,13],[69,3,69,13],[70,3,70,13],[62,1,65,1],[62,3,62,13],[63,3,63,13],[64,3,64,13],[65,3,65,13],[77,1,80,1],[77,3,77,13],[78,3,78,13],[79,3,79,13],[80,3,80,13],[72,1,75,1],[72,3,72,13],[73,3,73,13],[74,3,74,13],[75,3,75,13],[87,1,90,1],[87,3,87,13],[88,3,88,13],[89,3,89,13],[90,3,90,13],[82,1,85,1],[82,3,82,13],[83,3,83,13],[84,3,84,13],[85,3,85,13],[97,1,100,1],[97,3,97,13],[98,3,98,13],[99,3,99,13],[100,3,100,13],[92,1,95,1],[92,3,92,13],[93,3,93,13],[94,3,94,13],[95,3,95,13],[107,1,110,1],[107,3,107,13],[108,3,108,13],[109,3,109,13],[110,3,110,13],[102,1,105,1],[102,3,102,13],[103,3,103,13],[104,3,104,13],[105,3,105,13],[117,1,120,1],[117,3,117,13],[118,3,118,13],[119,3,119,13],[120,3,120,13],[112,1,115,1],[112,3,112,13],[113,3,113,13],[114,3,114,13],[115,3,115,13],[127,1,130,1],[127,3,127,13],[128,3,128,13],[129,3,129,13],[130,3,130,13],[122,1,125,1],[122,3,122,13],[123,3,123,13],[124,3,124,13],[125,3,125,13],[137,1,140,1],[137,3,137,13],[138,3,138,13],[139,3,139,13],[140,3,140,13],[132,1,135,1],[132,3,132,13],[133,3,133,13],[134,3,134,13],[135,3,135,13],[147,1,150,1],[147,3,147,13],[148,3,148,13],[149,3,149,13],[150,3,150,13],[142,1,145,1],[142,3,142,13],[143,3,143,13],[144,3,144,13],[145,3,145,13],[157,1,160,1],[157,3,157,13],[158,3,158,13],[159,3,159,13],[160,3,160,13],[152,1,155,1],[152,3,152,13],[153,3,153,13],[154,3,154,13],[155,3,155,13],[167,1,170,1],[167,3,167,13],[168,3,168,13],[169,3,169,13],[170,3,170,13],[162,1,165,1],[162,3,162,13],[163,3,163,13],[164,3,164,13],[165,3,165,13],[177,1,180,1],[177,3,177,13],[178,3,178,13],[179,3,179,13],[180,3,180,13],[172,1,175,1],[172,3,172,13],[173,3,173,13],[174,3,174,13],[175,3,175,13]]}
[null,null,null,"FORMATO DE REPORTES TRIMESTRALES"]
[]
[]
[null,"REPORTES TRIMESTRALES AVANCE CUANTITATIVO Y CUALITATIVO"]
[null,"NOMBRE DE LA SECRETARIA: ",null,"INMUJERES",null,null,null,null,null,null,null,null,null,null,null," "]
[null,"NOMBRE DE LA DIRECCIÓN O JEFATURA: ",null,"Políticas Publicas "]
[null,"TRIMESTRE REPORTADO:",null,"DEL 01 DE ABRIL AL 30 DE JUNIO DEL 2026"]
[null,"REGISTRO DE AVANCES DE PBR 2025-2026"]
[]
[null,null,"NOMBRE DE LA PROPUESTA","DIMENSIÓN A MEDIR (Eficiencia/Eficacia/  Economía/Calidad)","Nombre Indicador (Indicador Operativo)","UNIDAD DE MEDIDA ","LÍNEA BASE"," META ANUAL (ABSOLUTA)","AVANCE 1","AVANCE 2","AVANCE 3","AVANCE 4","AVANCE ACUMULADO EN PORCENTAJE","NOTAS,COMENTARIOS O CORRECCIONES QUE NECESITEN HACER"]
[null,null,null,null,null,null,null,null,"Primer Trimestre             (octubre-diciembre 2025)                        "," Segundo Trimestre           (enero-marzo 2026)                       ","Tercer Trimestre    (abril-junio 2026)                       "," Cuarto Trimestre (julio-septiembre 2026)                       "]
[null,1,{"$f":"IFERROR(VLOOKUP($D$5&$D$6&B12,'Pbr''s'!B:W,5,0),\" \")","v":"Acciones Para Una Vida Libre De Violencia"},"Eficacia",{"$f":"IFERROR(VLOOKUP($D$5&$D$6&B12&C12,'Pbr''s'!A:W,7,0),\" \")","v":"Porcentaje De Atenciones De Primer Contacto, Realizadas"},{"$f":"IFERROR(VLOOKUP($D$5&$D$6&B12&C12,'Pbr''s'!A:W,8,0),\" \")","v":"Número De Atenciones Realizadas"},{"$f":"IFERROR(VLOOKUP($D$5&$D$6&B12&C12,'Pbr''s'!A:W,9,0),\" \")","v":430},{"$f":"IFERROR(VLOOKUP($D$5&$D$6&B12&C12,'Pbr''s'!A:W,10,0),\" \")","v":500},117,147,79,null,{"$f":"(SUM(I12:L12)/H12)","v":0.68600000000000005}," "]
[null,"DESCRIPCIÓN DE LAS ACTIVIDADES REALIZADAS  (REDACTAR SÓLO LO REALIZADO EN TIEMPO PASADO) ","Narrativa de trimestre Octubre-Diciembre:                                                                                                                                                                                                                                                                                                                                                                                                                                                                                                                                                                                             ","Durante el periodo que se reporta, el Instituto brindó 117 atenciones de primer contacto, las cuales se desarrollaron bajo un enfoque de atención integral, garantizando el acceso a asesoría jurídica, atención psicológica y acompañamiento de trabajo social. Estas acciones permitieron identificar oportunamente las necesidades específicas de cada usuaria, así como establecer rutas de atención y canalización adecuadas. El resultado contribuye al fortalecimiento del acceso a servicios especializados y a la protección de los derechos de las mujeres atendidas."]
[null,null,"Narrativa de trimestre Enero-marzo:                                                                                                                                                                                                                                                                                                                                                                                                                                                                                                                                                                                                                                                                                                               ","Durante el periodo que se reporta, el Instituto brindó 147 atenciones de primer contacto, mismas que se desarrollaron bajo un enfoque de atención integral, garantizando el acceso a asesoría jurídica, atención psicológica y acompañamiento de trabajo social. Estas acciones permitieron identificar de manera oportuna las necesidades específicas de cada usuaria, así como establecer rutas de atención y canalización adecuadas. El resultado contribuye al fortalecimiento del acceso a servicios especializados y a la protección de los derechos de las mujeres atendidas."]
[null,null,"Narrativa de trimestre Abril-junio:                                                                                                                                                                                                                                                                                                                                                                                                                                                                                                                                                                                                                                                                                                                                                                                                                                                                                                                                                                                                                                               ","Durante el periodo que se reporta, el Instituto brindó 79 atenciones de primer contacto, mismas que se desarrollaron bajo un enfoque de atención integral, garantizando el acceso a asesoría jurídica, atención psicológica y acompañamiento de trabajo social. Estas acciones permitieron identificar de manera oportuna las necesidades específicas de cada usuaria, así como establecer rutas de atención y canalización adecuadas. El resultado contribuye al fortalecimiento del acceso a servicios especializados y a la protección de los derechos de las mujeres atendidas."]
[null,null,"Narrativa de trimestre Julio-sept:"]
[null,2,{"$f":"IFERROR(VLOOKUP($D$5&$D$6&B17,'Pbr''s'!B:W,5,0),\" \")","v":"Acciones Para Una Vida Libre De Violencia"},"Eficacia",{"$f":"IFERROR(VLOOKUP($D$5&$D$6&B17&C17,'Pbr''s'!A:W,7,0),\" \")","v":"Porcentaje De Acciones De Prevención De La Violencia De Género En La Comunidad, Realizadas"},{"$f":"IFERROR(VLOOKUP($D$5&$D$6&B17&C17,'Pbr''s'!A:W,8,0),\" \")","v":"Número De Acciones Realizadas"},{"$f":"IFERROR(VLOOKUP($D$5&$D$6&B17&C17,'Pbr''s'!A:W,9,0),\" \")","v":40},{"$f":"IFERROR(VLOOKUP($D$5&$D$6&B17&C17,'Pbr''s'!A:W,10,0),\" \")","v":45},10,13,7,null,{"$f":"(SUM(I17:L17)/H17)","v":0.66666666666666663}]
[null,"DESCRIPCIÓN DE LAS ACTIVIDADES REALIZADAS  (REDACTAR SÓLO LO REALIZADO EN TIEMPO PASADO) ","Narrativa de trimestre Octubre-Diciembre:                                                                                                                                                                                                                                                                                                                                                                                                                                                                                                                                                                                             ","Durante el periodo que se reporta se llevaron a cabo 10 acciones de prevención de la violencia de género, mediante capacitaciones y actividades comunitarias con enfoque preventivo y de sensibilización. Estas acciones consistieron en: 1) la participación constante del Instituto en las Ferias de Paz realizadas en diversas comunidades de San Pedro Tlaquepaque; 2) la participación permanente en la Mesa de Género de la Secretaría de Gobernación, que sesiona de manera semanal; 3) una charla sobre consentimiento dirigida al estudiantado de la Preparatoria Santa Anita; 4) la realización de un taller masivo de defensa personal en el marco del 25 de noviembre (25N); 5) la actividad “Niñas por un mundo libre de violencia” en la Primaria Vicente Guerrero; 6) un taller de defensa personal en la delegación Las Juntas; 7) un taller de defensa personal en Toluquilla; 8) un taller mencionado en San Martín de las Flores; 9) una capacitación sobre violencia de género dirigida a personal de la Subdirección de Profesionalización y Acreditación Policial; y 10) talleres de defensa personal en las delegaciones de Tateposco y Santa Anita. En conjunto, estas acciones contribuyeron al fortalecimiento de la prevención primaria y al impacto comunitario del Instituto en la reducción de factores de riesgo asociados a la violencia de género."]
[null,null,"Narrativa de trimestre Enero-marzo:                                                                                                                                                                                                                                                                                                                                                                                                                                                                                                                                                                                                                                                                                                               ","Durante el periodo que se reporta, se llevaron a cabo 13 acciones de prevención de la violencia de género en la comunidad, orientadas a la sensibilización y fortalecimiento de capacidades en distintos sectores. Destacan 9 intervenciones dirigidas a personal de la Secretaría de Seguridad y Protección Ciudadana, abordando temas como feminicidio, violencia de género, violencia familiar y violencia sexual en espacios públicos. Asimismo, se realizaron actividades en la Universidad UNIVER, la empresa AMPM y la empresa Arrow, así como en la Preparatoria Regional de Santa Anita de la UdeG, abordando temas como rutas de atención ante la violencia, tipos y modalidades de violencia, defensa personal, amor romántico y violencias invisibles. De igual forma, al interior del Instituto se impartió capacitación en materia de violencia de género, contribuyendo al fortalecimiento institucional y comunitario en la prevención de estas problemáticas."]
[null,null,"Narrativa de trimestre Abril-junio:                                                                                                                                                                                                                                                                                                                                                                                                                                                                                                                                                                                                                                                                                                                                                                                                                                                                                                                                                                                                                                               ","Durante el periodo que se reporta, se llevaron a cabo 7 acciones de prevención de la violencia de género en la comunidad. Destacando intervenciones a Cadetes de la subsecretaria de profesionalización y acreditación policial, empresa Lavartex y Coca cola sede Toluquilla con inteligencia emocional y resilencia, límites en las relaciones, los si los no, los nunca:hablemos del consentimiento. Asimismo se realizaron actividades en colonias con el tema de Autoestima y amor propio, el amor también se cuida, salud emocional de mamá en las colonias de Lomas de San Miguel, Campesino, Cofradía y el cerro del cuatro con el objetivo de seguir las estrategias de prevención de las violencias de género."]
{"$rows_left_out":162}
{"sheet":"Pbr's","index":1,"n_rows":600,"n_cols":12,"rows_kept":600,"cut":false,"hidden":true,"merged":[]}
[null,null,null,"SECRETARIA","DIRECCIONES","Proyecto","Indicador Operativo","Unidad de medida","Línea Base","Meta",null,"Dimension a Medir"]
[{"$f":"B2&F2","v":"ComucatComucat1Capacitaciones Preventivas En Adicciones "},{"$f":"D2&E2&C2","v":"ComucatComucat1"},{"$f":"COUNTIF($E$2:E2,E2:E2)","v":1},"Comucat","Comucat","Capacitaciones Preventivas En Adicciones ","Porcentaje De Personas Capacitadas En Tema De Prevención De Adicciones ","Número De Personas Capacitadas ",4900,7000,null,"Eficiencia"]
[{"$f":"B3&F3","v":"ComucatComucat2Jornadas De La Salud Mental"},{"$f":"D3&E3&C3","v":"ComucatComucat2"},{"$f":"COUNTIF($E$2:E3,E3:E3)","v":2},"Comucat","Comucat","Jornadas De La Salud Mental","Porcentaje De Eventos Realizados Con Temas De Salud Mental ","Número De Eventos Realizados ",0,4,null,"Eficacia"]
["ComucatComucat3Red De Apoyo Para Establecimientos Especializados En Adicciones ","ComucatComucat3",{"$f":"COUNTIF($E$2:E4,E4:E4)","v":3},"Comucat","Comucat","Red De Apoyo Para Establecimientos Especializados En Adicciones ","Porcentaje De Establecimientos Especializados En Adicciones Registrados Ante El Comucat","Número De Establecimientos Registrados ",55,65,null,"Economía"]
["ComucatComucat4Red De Apoyo Para Establecimientos Especializados En Adicciones ","ComucatComucat4",{"$f":"COUNTIF($E$2:E5,E5:E5)","v":4},"Comucat","Comucat","Red De Apoyo Para Establecimientos Especializados En Adicciones ","Porcentaje De Capacitaciones Otorgadas A Los Establecimientos ","Número De Capacitaciones Otorgadas ",8,12,null,"Calidad"]
["ComucatComucat5Terapias Psicológicas (Tratamiento Breve Y/O Ambulatorio)","ComucatComucat5",{"$f":"COUNTIF($E$2:E6,E6:E6)","v":5},"Comucat","Comucat","Terapias Psicológicas (Tratamiento Breve Y/O Ambulatorio)","Porcentaje De Personas Atendidas Mediante Terapia Psicológica ","Número De Personas Atendidas ",216,400]
["COMUDECOMUDE1Administración Y Gestión Institucional","COMUDECOMUDE1",{"$f":"COUNTIF($E$2:E7,E7:E7)","v":1},"COMUDE","COMUDE","Administración Y Gestión Institucional","Porcentaje de convenios elaborados para el programa de Administración y Gestión Institucional.","Número de convenios elaborados",241,250]
["COMUDECOMUDE2Tlaquepaque Acude","COMUDECOMUDE2",{"$f":"COUNTIF($E$2:E8,E8:E8)","v":2},"COMUDE","COMUDE","Tlaquepaque Acude","Porcentaje de Escuelas y talleres de activación física implementados.","Número de escuelas y talleres de activación física implementados.",130,150]
["COMUDECOMUDE3Tlaquepaque Acude","COMUDECOMUDE3",{"$f":"COUNTIF($E$2:E9,E9:E9)","v":3},"COMUDE","COMUDE","Tlaquepaque Acude","Porcentaje de Ligas deportivas implementadas.","Número ligas deportivas implementadas.",37,40]
["COMUDECOMUDE4Administración Y Gestión Institucional","COMUDECOMUDE4",{"$f":"COUNTIF($E$2:E10,E10:E10)","v":4},"COMUDE","COMUDE","Administración Y Gestión Institucional","Porcentaje de Intervenciones en el programa de Mantenimiento de Espacios Públicos realizadas.","Número de intervenciones realizadas.",120,140]
["COMUDECOMUDE5Macro Eventos","COMUDECOMUDE5",{"$f":"COUNTIF($E$2:E11,E11:E11)","v":5},"COMUDE","COMUDE","Macro Eventos","Porcentaje de Macro Eventos Realizados.","Número de Macro Eventos Realizados",18,20]
["COMUDECOMUDE6Vía Recreativa Metropolitana San Pedro Tlaquepaque","COMUDECOMUDE6",{"$f":"COUNTIF($E$2:E12,E12:E12)","v":6},"COMUDE","COMUDE","Vía Recreativa Metropolitana San Pedro Tlaquepaque","Porcentaje de Jornadas dominicales de la Vía Recreativa, realizadas","Número de jornadas realizadas ",55,55]
["DIFAdulto Mayor1Colibrí Esperanza, Centro De Dia ","DIFAdulto Mayor1",{"$f":"COUNTIF($E$2:E13,E13:E13)","v":1},"DIF","Adulto Mayor","Colibrí Esperanza, Centro De Dia ","Servicios Otorgados Porcentaje De Servicios Integrales A Los Adultos Mayores Otorgados ","Número De Servicios Otorgados ",0,5000]
["DIFAdulto Mayor2Colibrí Esperanza, Centro De Dia ","DIFAdulto Mayor2",{"$f":"COUNTIF($E$2:E14,E14:E14)","v":2},"DIF","Adulto Mayor","Colibrí Esperanza, Centro De Dia ","Talleres Otorgados Porcentaje De Talleres ","Numero De Talleres Otorgados",0,5000]
["DIFAdulto Mayor3Colibrí Esperanza, Centro De Dia ","DIFAdulto Mayor3",{"$f":"COUNTIF($E$2:E15,E15:E15)","v":3},"DIF","Adulto Mayor","Colibrí Esperanza, Centro De Dia ","Actividades Recreativa, Culturales Y Deportivas","Atención En Actividades Recreativa, Culturales Y Deportivas",0,6400]
["DIFAsistencia Alimentaria1Área Alimentaria ","DIFAsistencia Alimentaria1",{"$f":"COUNTIF($E$2:E16,E16:E16)","v":1},"DIF","Asistencia Alimentaria","Área Alimentaria ","Raciones De Alimentos En Escolares","Cantidad De Raciones Entregadas",952167,952167]
["DIFAsistencia Alimentaria2Área Alimentaria ","DIFAsistencia Alimentaria2",{"$f":"COUNTIF($E$2:E17,E17:E17)","v":2},"DIF","Asistencia Alimentaria","Área Alimentaria ","Dotaciones Alimentarias","Cantidad De Despensas",32208,32208]
[{"$f":"B18&F18","v":"DIFAsistencia Alimentaria3Área Alimentaria "},"DIFAsistencia Alimentaria3",{"$f":"COUNTIF($E$2:E18,E18:E18)","v":3},"DIF","Asistencia Alimentaria","Área Alimentaria ","Capacitaciones De Orientación Alimentaria ","Cantidad De Beneficiarios Que Reciben ",19944,19944]
["DIFAsistencia Alimentaria4Área Alimentaria ","DIFAsistencia Alimentaria4",{"$f":"COUNTIF($E$2:E19,E19:E19)","v":4},"DIF","Asistencia Alimentaria","Área Alimentaria ","Raciones De Alimentos Preparados  En Comedores Comunitarios","Cantidad De Raciones Entregadas",13920,13920]
["DIFApce1Tlaquepaque Solidario: Atención Y Protección En Situaciones De Emergencia","DIFApce1",{"$f":"COUNTIF($E$2:E20,E20:E20)","v":1},"DIF","Apce","Tlaquepaque Solidario: Atención Y Protección En Situaciones De Emergencia","Número De Personas En Situación De Calle Y Población Vulnerable Atendida Mediante Apoyos Y Programas Emergentes.","Personas Atendidas",0,1000]
{"$rows_left_out":580}